GoboLinux bug tracker

View Issue Details Jump to Notes ] Issue History ] Print ]
IDProjectCategoryView StatusDate SubmittedLast Update
0000390Recipespublic2009-01-09 19:102009-02-17 22:17
Reporterquest2013 
Assigned To 
PrioritynormalSeverityminorReproducibilityalways
StatusresolvedResolutionfixed 
PlatformOSOS Version
Summary0000390: Xorg-Server 1.5.2-r5 build fails
DescriptionCompiling Xorg-Server 1.5.2-r5 results in a "Build process failed" error.


Here is the terminal output for this error:


In file included from glxdriswrast.c:49:
glxdricommon.h:32: error: expected ':', ',', ';', '}' or '__attribute__' before '*' token
glxdricommon.h:36: warning: type defaults to 'int' in declaration of '__DRIcoreExtension'
glxdricommon.h:36: error: expected ';', ',' or ')' before '*' token
glxdricommon.h:38: error: expected '=', ',', ';', 'asm' or '__attribute__' before 'systemTimeExtension'
glxdriswrast.c:67: error: expected ':', ',', ';', '}' or '__attribute__' before '*' token
glxdriswrast.c: In function '__glXDRIdrawableDestroy':
glxdriswrast.c:92: error: expected '=', ',', ';', 'asm' or '__attribute__' before '*' token
glxdriswrast.c:92: error: 'core' undeclared (first use in this function)
glxdriswrast.c:92: error: (Each undeclared identifier is reported only once
glxdriswrast.c:92: error: for each function it appears in.)
glxdriswrast.c:92: error: '__GLXDRIscreen' has no member named 'core'
glxdriswrast.c: In function '__glXDRIdrawableSwapBuffers':
glxdriswrast.c:116: error: expected '=', ',', ';', 'asm' or '__attribute__' before '*' token
glxdriswrast.c:116: error: 'core' undeclared (first use in this function)
glxdriswrast.c:116: error: '__GLXDRIscreen' has no member named 'core'
glxdriswrast.c: In function '__glXDRIdrawableCopySubBuffer':
glxdriswrast.c:128: error: expected '=', ',', ';', 'asm' or '__attribute__' before '*' token
glxdriswrast.c:128: error: 'copySubBuffer' undeclared (first use in this function)
glxdriswrast.c:129: error: '__GLXDRIscreen' has no member named 'copySubBuffer'
glxdriswrast.c: In function '__glXDRIcontextDestroy':
glxdriswrast.c:141: error: '__GLXDRIscreen' has no member named 'core'
glxdriswrast.c: In function '__glXDRIcontextMakeCurrent':
glxdriswrast.c:154: error: '__GLXDRIscreen' has no member named 'core'
glxdriswrast.c: In function '__glXDRIcontextLoseCurrent':
glxdriswrast.c:165: error: '__GLXDRIscreen' has no member named 'core'
glxdriswrast.c: In function '__glXDRIcontextCopy':
glxdriswrast.c:176: error: '__GLXDRIscreen' has no member named 'core'
glxdriswrast.c: In function '__glXDRIcontextForceCurrent':
glxdriswrast.c:188: error: '__GLXDRIscreen' has no member named 'core'
glxdriswrast.c: In function '__glXDRIscreenDestroy':
glxdriswrast.c:253: error: '__GLXDRIscreen' has no member named 'core'
glxdriswrast.c: In function '__glXDRIscreenCreateContext':
glxdriswrast.c:270: error: expected '=', ',', ';', 'asm' or '__attribute__' before '*' token
glxdriswrast.c:270: error: 'core' undeclared (first use in this function)
glxdriswrast.c:270: error: '__GLXDRIscreen' has no member named 'core'
glxdriswrast.c:293: error: '__GLXDRIconfig' has no member named 'driConfig'
glxdriswrast.c: In function '__glXDRIscreenCreateDrawable':
glxdriswrast.c:347: error: '__GLXDRIscreen' has no member named 'swrast'
glxdriswrast.c:348: error: '__GLXDRIconfig' has no member named 'driConfig'
glxdriswrast.c: In function 'swrastPutImage':
glxdriswrast.c:378: error: '__DRI_SWRAST_IMAGE_OP_DRAW' undeclared (first use in this function)
glxdriswrast.c:381: error: '__DRI_SWRAST_IMAGE_OP_CLEAR' undeclared (first use in this function)
glxdriswrast.c:384: error: '__DRI_SWRAST_IMAGE_OP_SWAP' undeclared (first use in this function)
glxdriswrast.c: At top level:
glxdriswrast.c:409: error: expected '=', ',', ';', 'asm' or '__attribute__' before 'swrastLoaderExtension'
glxdriswrast.c:416: error: expected '=', ',', ';', 'asm' or '__attribute__' before '*' token
glxdriswrast.c: In function 'initializeExtensions':
glxdriswrast.c:425: error: expected '=', ',', ';', 'asm' or '__attribute__' before '*' token
glxdriswrast.c:425: error: 'extensions' undeclared (first use in this function)
glxdriswrast.c:428: error: '__GLXDRIscreen' has no member named 'core'
glxdriswrast.c: In function '__glXDRIscreenProbe':
glxdriswrast.c:458: error: expected '=', ',', ';', 'asm' or '__attribute__' before '*' token
glxdriswrast.c:458: error: 'extensions' undeclared (first use in this function)
glxdriswrast.c:459: error: expected '=', ',', ';', 'asm' or '__attribute__' before '*' token
glxdriswrast.c:459: error: 'driConfigs' undeclared (first use in this function)
glxdriswrast.c:483: error: '__DRI_DRIVER_EXTENSIONS' undeclared (first use in this function)
glxdriswrast.c:491: error: '__DRI_CORE' undeclared (first use in this function)
glxdriswrast.c:492: error: '__DRI_CORE_VERSION' undeclared (first use in this function)
glxdriswrast.c:493: error: '__GLXDRIscreen' has no member named 'core'
glxdriswrast.c:493: error: expected ')' before '__DRIcoreExtension'
glxdriswrast.c:493: warning: type defaults to 'int' in declaration of 'type name'
glxdriswrast.c:495: error: '__DRI_SWRAST' undeclared (first use in this function)
glxdriswrast.c:496: error: '__DRI_SWRAST_VERSION' undeclared (first use in this function)
glxdriswrast.c:497: error: '__GLXDRIscreen' has no member named 'swrast'
glxdriswrast.c:497: error: expected ')' before '__DRIswrastExtension'
glxdriswrast.c:497: warning: type defaults to 'int' in declaration of 'type name'
glxdriswrast.c:501: error: '__GLXDRIscreen' has no member named 'core'
glxdriswrast.c:501: error: '__GLXDRIscreen' has no member named 'swrast'
glxdriswrast.c:508: error: '__GLXDRIscreen' has no member named 'swrast'
glxdriswrast.c:509: error: 'loader_extensions' undeclared (first use in this function)
glxdriswrast.c:520: warning: implicit declaration of function 'glxConvertConfigs'
glxdriswrast.c:520: warning: nested extern declaration of 'glxConvertConfigs'
glxdriswrast.c:520: error: '__GLXDRIscreen' has no member named 'core'
glxdriswrast.c:520: warning: assignment makes pointer from integer without a cast
make[1]: *** [glxdriswrast.lo] Error 1
make[1]: Leaving directory `/Files/Compile/Sources/xorg-server-1.5.2/glx'
make: *** [all-recursive] Error 1
Compile: Xorg-Server 1.5.2 - Build process failed.


[/terminal output]
Additional InformationFor your reference, the following commands were used on a fresh and full install of GoboLinux 014, followed by a system reboot after every item:


'InstallPackage Manager 1.1.6'

'InstallPackage Scripts 2.9.1'

'InstallPackage Compile 1.11.0'

'InstallPackage Scripts 2.9.2'

'InstallPackage Scripts 2.9.3'

'InstallPackage Compile 1.11.1'

'InstallPackage Scripts 2.9.4'

'InstallPackage Compile 1.11.2'

'InstallPackage Scripts 2.9.5'

'InstallPackage Compile 1.11.3'

'InstallPackage Scripts 2.9.6'

'InstallPackage Compile 1.11.4'

'InstallPackage Scripts 2.9.7'

'Compile Xorg-Proto 7.4-r4'

'Compile Xorg-Lib 7.4-r5'

'InstallPackage Glibc 2.8-r3'

'InstallPackage FindUtils 4.4.0-r2'

'Compile LibDRM 2.4.1-r1'

'Compile Makedepend 1.0.1-r2'

'Compile Mesa 7.2-r3'


[/list]


Question: Is rebooting the system after every compile/install necessary and/or recommended?
TagsNo tags attached.
Attached Files

- Relationships

-  Notes
(0000948)
mohjive (administrator)
2009-02-17 22:17

This was because to Mesa not being installed correctly due to conflicting headers with Xorg 7.2. A new Mesa recipe, solving this has been commited. Thanks for the report.

- Issue History
Date Modified Username Field Change
2009-01-09 19:10 quest2013 New Issue
2009-02-17 22:17 mohjive Note Added: 0000948
2009-02-17 22:17 mohjive Status new => resolved
2009-02-17 22:17 mohjive Resolution open => fixed
2009-02-17 22:17 mohjive Additional Information Updated


Copyright © 2000 - 2017 MantisBT Team
GoboLinux Bug Tracker